[svlug] qtparted-0.5.0 missing something still...

Michael C. Robinson plug_1 at robinson-west.com
Fri Nov 27 19:54:06 PST 2015


Should be a short attachment with the the output of, (Assuming that
doesn't get stripped):

cmake 1>output_cmake.txt 2>&1 .

and

make 1>>output_cmake.txt 2>&1

I am suspecting that there is something wrong with my parted
installation.  If there is enough information in the attached output to
make an educated guess, great.  If not, how can I get the information I
need???  I know adding software to a Linux from scratch system is
adding software the hard way, but really there are only 2-3 things left
to add that I really want.  For educational reasons, I'd like to learn
what the problem is at least.

Another thing I want that should be fairly easy to add, I want LXDE to
have Firefox 36 in the menu.
-------------- next part --------------
-- The C compiler identification is GNU 4.9.2
-- The CXX compiler identification is GNU 4.9.2
-- Check for working C compiler: /usr/bin/cc
-- Check for working C compiler: /usr/bin/cc -- works
-- Detecting C compiler ABI info
-- Detecting C compiler ABI info - done
-- Detecting C compile features
-- Detecting C compile features - done
-- Check for working CXX compiler: /usr/bin/c++
-- Check for working CXX compiler: /usr/bin/c++ -- works
-- Detecting CXX compiler ABI info
-- Detecting CXX compiler ABI info - done
-- Detecting CXX compile features
-- Detecting CXX compile features - done
-- Looking for Q_WS_X11
-- Looking for Q_WS_X11 - found
-- Looking for Q_WS_WIN
-- Looking for Q_WS_WIN - not found
-- Looking for Q_WS_QWS
-- Looking for Q_WS_QWS - not found
-- Looking for Q_WS_MAC
-- Looking for Q_WS_MAC - not found
-- Found Qt4: /opt/qt4/bin/qmake (found version "4.8.6") 
CMake Warning (dev) at ts/CMakeLists.txt:9 (add_custom_target):
  Policy CMP0037 is not set: Target names should not be reserved and should
  match a validity pattern.  Run "cmake --help-policy CMP0037" for policy
  details.  Use the cmake_policy command to set the policy and suppress this
  warning.

  The target name "all" is reserved or not valid for certain CMake features,
  such as generator expressions, and may result in undefined behavior.
This warning is for project developers.  Use -Wno-dev to suppress it.

-- Configuring done
-- Generating done
-- Build files have been written to: /home/michael/qtparted-0.5.0
Makefile:164: warning: overriding recipe for target 'all'
Makefile:117: warning: ignoring old recipe for target 'all'
Generating ui_qp_ui_resize.h
Generating moc_qtparted.cxx
/home/michael/qtparted-0.5.0/src/qtparted.h:0: Note: No relevant classes found. No output generated.
Generating moc_qp_dlgcreate.cxx
Generating moc_qp_dlgdevprop.cxx
Generating moc_qp_dlgformat.cxx
Generating moc_qp_dlgconfig.cxx
Generating moc_qp_dlgresize.cxx
Generating moc_qp_dlgprogress.cxx
Generating moc_qp_drivelist.cxx
Generating moc_qp_devlist.cxx
/home/michael/qtparted-0.5.0/src/qp_devlist.h:0: Note: No relevant classes found. No output generated.
Generating moc_qp_libparted.cxx
Generating moc_qp_partlist.cxx
Generating moc_qp_actlist.cxx
Generating moc_qp_extended.cxx
Generating moc_qp_listchart.cxx
Generating moc_qp_partition.cxx
Generating moc_qp_partwidget.cxx
Generating moc_qp_diskview.cxx
Generating moc_qp_window.cxx
Generating moc_qp_combospin.cxx
Generating moc_qp_exttools.cxx
/home/michael/qtparted-0.5.0/src/qp_exttools.h:0: Note: No relevant classes found. No output generated.
Generating moc_qp_listview.cxx
Generating moc_qp_settings.cxx
Generating moc_qp_common.cxx
/home/michael/qtparted-0.5.0/src/qp_common.h:0: Note: No relevant classes found. No output generated.
Generating moc_qp_filesystem.cxx
/home/michael/qtparted-0.5.0/src/qp_filesystem.h:0: Note: No relevant classes found. No output generated.
Generating moc_qp_navview.cxx
Generating moc_qp_fswrap.cxx
Generating moc_qp_sizepart.cxx
Generating moc_qp_spinbox.cxx
Generating moc_statistics.cxx
/home/michael/qtparted-0.5.0/src/statistics.h:0: Note: No relevant classes found. No output generated.
Generating ui_qp_ui_config.h
Generating moc_ui_qp_ui_config.cxx
/home/michael/qtparted-0.5.0/src/ui_qp_ui_config.h:0: Note: No relevant classes found. No output generated.
Generating ui_qp_ui_create.h
Generating moc_ui_qp_ui_create.cxx
/home/michael/qtparted-0.5.0/src/ui_qp_ui_create.h:0: Note: No relevant classes found. No output generated.
Generating ui_qp_ui_devprop.h
/home/michael/qtparted-0.5.0/src/qp_ui_devprop.ui: Warning: Buddy assignment: 'cmbLayout' is not a valid widget.
/home/michael/qtparted-0.5.0/src/qp_ui_devprop.ui: Warning: Buddy assignment: 'cmbExtTools' is not a valid widget.
/home/michael/qtparted-0.5.0/src/qp_ui_devprop.ui: Warning: Buddy assignment: 'cmbExtTools' is not a valid widget.
/home/michael/qtparted-0.5.0/src/qp_ui_devprop.ui: Warning: Buddy assignment: 'cmbExtTools' is not a valid widget.
Generating moc_ui_qp_ui_devprop.cxx
/home/michael/qtparted-0.5.0/src/ui_qp_ui_devprop.h:0: Note: No relevant classes found. No output generated.
Generating ui_qp_ui_format.h
Generating moc_ui_qp_ui_format.cxx
/home/michael/qtparted-0.5.0/src/ui_qp_ui_format.h:0: Note: No relevant classes found. No output generated.
Generating ui_qp_ui_progress.h
Generating moc_ui_qp_ui_progress.cxx
/home/michael/qtparted-0.5.0/src/ui_qp_ui_progress.h:0: Note: No relevant classes found. No output generated.
Generating moc_ui_qp_ui_resize.cxx
/home/michael/qtparted-0.5.0/src/ui_qp_ui_resize.h:0: Note: No relevant classes found. No output generated.
Scanning dependencies of target qtparted
Building CXX object src/CMakeFiles/qtparted.dir/main.cpp.o
Building CXX object src/CMakeFiles/qtparted.dir/qp_dlgcreate.cpp.o
Building CXX object src/CMakeFiles/qtparted.dir/qp_dlgdevprop.cpp.o
Building CXX object src/CMakeFiles/qtparted.dir/qp_dlgformat.cpp.o
Building CXX object src/CMakeFiles/qtparted.dir/qp_dlgconfig.cpp.o
Building CXX object src/CMakeFiles/qtparted.dir/qp_dlgresize.cpp.o
Building CXX object src/CMakeFiles/qtparted.dir/qp_dlgprogress.cpp.o
Building CXX object src/CMakeFiles/qtparted.dir/qp_drivelist.cpp.o
Building CXX object src/CMakeFiles/qtparted.dir/qp_devlist.cpp.o
Building CXX object src/CMakeFiles/qtparted.dir/qp_libparted.cpp.o
/home/michael/qtparted-0.5.0/src/qp_libparted.cpp: In member function ‘void QP_LibParted::get_filesystem(QP_FileSystem*)’:
/home/michael/qtparted-0.5.0/src/qp_libparted.cpp:718:48: error: ‘PedFileSystemOps’ has no member named ‘create’
                                     walk->ops->create,
                                                ^
/home/michael/qtparted-0.5.0/src/qp_libparted.cpp:719:48: error: ‘PedFileSystemOps’ has no member named ‘resize’
                                     walk->ops->resize,
                                                ^
/home/michael/qtparted-0.5.0/src/qp_libparted.cpp:720:48: error: ‘PedFileSystemOps’ has no member named ‘copy’
                                     walk->ops->copy,   //Move and copy is the same thing for parted!
                                                ^
/home/michael/qtparted-0.5.0/src/qp_libparted.cpp:721:48: error: ‘PedFileSystemOps’ has no member named ‘copy’
                                     walk->ops->copy );
                                                ^
/home/michael/qtparted-0.5.0/src/qp_libparted.cpp: In member function ‘int QP_LibParted::mkfs(QP_PartInfo*, QP_FileSystemSpec*, QString)’:
/home/michael/qtparted-0.5.0/src/qp_libparted.cpp:1063:67: error: ‘ped_file_system_create’ was not declared in this scope
         fs = ped_file_system_create ( &part->geom, fs_type, timer );
                                                                   ^
/home/michael/qtparted-0.5.0/src/qp_libparted.cpp:1087:53: error: ‘ped_file_system_clobber’ was not declared in this scope
         if ( !ped_file_system_clobber ( &part->geom ) )
                                                     ^
/home/michael/qtparted-0.5.0/src/qp_libparted.cpp: In member function ‘int QP_LibParted::mkpart(QTParted::partType, PedSector, PedSector, QP_FSWrap*, QString)’:
/home/michael/qtparted-0.5.0/src/qp_libparted.cpp:1238:53: error: ‘ped_file_system_clobber’ was not declared in this scope
         if ( !ped_file_system_clobber ( &part->geom ) )
                                                     ^
/home/michael/qtparted-0.5.0/src/qp_libparted.cpp: In member function ‘int QP_LibParted::mkpartfs(QTParted::partType, QP_FileSystemSpec*, PedSector, PedSector, QString)’:
/home/michael/qtparted-0.5.0/src/qp_libparted.cpp:1368:71: error: ‘ped_file_system_get_create_constraint’ was not declared in this scope
     constraint = ped_file_system_get_create_constraint ( fs_type, dev );
                                                                       ^
/home/michael/qtparted-0.5.0/src/qp_libparted.cpp:1402:67: error: ‘ped_file_system_create’ was not declared in this scope
         fs = ped_file_system_create ( &part->geom, fs_type, timer );
                                                                   ^
/home/michael/qtparted-0.5.0/src/qp_libparted.cpp: In member function ‘bool QP_LibParted::move(QP_PartInfo*, PedSector, PedSector)’:
/home/michael/qtparted-0.5.0/src/qp_libparted.cpp:1620:64: error: ‘ped_file_system_get_copy_constraint’ was not declared in this scope
     constraint = ped_file_system_get_copy_constraint ( fs, dev );
                                                                ^
/home/michael/qtparted-0.5.0/src/qp_libparted.cpp:1661:65: error: ‘ped_file_system_copy’ was not declared in this scope
         fs_copy = ped_file_system_copy ( fs, &part->geom, timer );
                                                                 ^
/home/michael/qtparted-0.5.0/src/qp_libparted.cpp: In member function ‘bool QP_LibParted::_test_move(QP_PartInfo*, PedSector, PedSector)’:
/home/michael/qtparted-0.5.0/src/qp_libparted.cpp:1756:64: error: ‘ped_file_system_get_copy_constraint’ was not declared in this scope
     constraint = ped_file_system_get_copy_constraint ( fs, dev );
                                                                ^
src/CMakeFiles/qtparted.dir/build.make:501: recipe for target 'src/CMakeFiles/qtparted.dir/qp_libparted.cpp.o' failed
make[2]: *** [src/CMakeFiles/qtparted.dir/qp_libparted.cpp.o] Error 1
CMakeFiles/Makefile2:90: recipe for target 'src/CMakeFiles/qtparted.dir/all' failed
make[1]: *** [src/CMakeFiles/qtparted.dir/all] Error 2
Makefile:164: recipe for target 'all' failed
make: *** [all] Error 2


More information about the svlug mailing list